ID,M/F,Hand,Age,Educ,SES,MMSE,CDR,eTIV,nWBV,ASF,Delay
OAS1_0001_MR1,F,R,74,2,3,29,0,1344,0.743,1.306,N/A
OAS1_0002_MR1,F,R,55,4,1,29,0,1147,0.81,1.531,N/A
OAS1_0003_MR1,F,R,73,4,3,27,0.5,1454,0.708,1.207,N/A
OAS1_0004_MR1,M,R,28,,,,,1588,0.803,1.105,N/A
OAS1_0005_MR1,M,R,18,,,,,1737,0.848,1.01,N/A
OAS1_0006_MR1,F,R,24,,,,,1131,0.862,1.551,N/A
OAS1_0007_MR1,M,R,21,,,,,1516,0.83,1.157,N/A
OAS1_0009_MR1,F,R,20,,,,,1505,0.843,1.166,N/A
OAS1_0010_MR1,M,R,74,5,2,30,0,1636,0.689,1.073,N/A
OAS1_0011_MR1,F,R,52,3,2,30,0,1321,0.827,1.329,N/A
OAS1_0012_MR1,M,R,30,,,,,1574,0.842,1.115,N/A
OAS1_0013_MR1,F,R,81,5,2,30,0,1664,0.679,1.055,N/A
OAS1_0014_MR1,F,R,19,,,,,1525,0.856,1.151,N/A
OAS1_0015_MR1,M,R,76,2,,28,0.5,1738,0.719,1.01,N/A
OAS1_0016_MR1,M,R,82,2,4,27,0.5,1477,0.739,1.188,N/A
OAS1_0017_MR1,M,R,21,,,,,1689,0.845,1.039,N/A
OAS1_0018_MR1,M,R,39,3,4,28,0,1636,0.813,1.073,N/A
OAS1_0019_MR1,F,R,89,5,1,30,0,1536,0.715,1.142,N/A
OAS1_0020_MR1,F,R,48,5,2,29,0,1326,0.785,1.323,N/A
OAS1_0021_MR1,F,R,80,3,3,23,0.5,1794,0.765,0.978,N/A
OAS1_0022_MR1,F,R,69,2,4,23,0.5,1447,0.757,1.213,N/A
OAS1_0023_MR1,M,R,82,2,3,27,0.5,1420,0.71,1.236,N/A
OAS1_0025_MR1,F,R,24,,,,,1240,0.893,1.415,N/A
OAS1_0026_MR1,F,R,58,5,1,30,0,1235,0.82,1.421,N/A
OAS1_0027_MR1,F,R,43,,,,,1194,0.834,1.47,N/A
OAS1_0028_MR1,F,R,86,2,4,27,1,1449,0.738,1.211,N/A
OAS1_0029_MR1,M,R,21,,,,,1653,0.858,1.062,N/A
OAS1_0030_MR1,F,R,65,2,3,29,0,1392,0.764,1.261,N/A
OAS1_0031_MR1,M,R,88,1,4,26,1,1419,0.674,1.236,N/A
OAS1_0032_MR1,M,R,89,4,1,28,0,1631,0.682,1.076,N/A
OAS1_0033_MR1,F,R,80,4,2,29,0,1323,0.735,1.326,N/A
OAS1_0034_MR1,M,R,51,5,1,29,0,1538,0.831,1.141,N/A
OAS1_0035_MR1,F,R,84,3,2,28,1,1402,0.695,1.252,N/A
OAS1_0037_MR1,M,R,27,,,,,1313,0.842,1.336,N/A
OAS1_0038_MR1,F,R,23,,,,,1443,0.839,1.216,N/A
OAS1_0039_MR1,M,R,70,4,3,29,0.5,1463,0.772,1.2,N/A
OAS1_0040_MR1,F,R,38,,,,,1244,0.824,1.411,N/A
OAS1_0041_MR1,F,R,62,2,,28,0.5,1350,0.758,1.3,N/A
OAS1_0042_MR1,M,R,80,4,2,29,0.5,1854,0.709,0.947,N/A
OAS1_0043_MR1,M,R,21,,,,,1511,0.846,1.162,N/A
OAS1_0044_MR1,F,R,47,4,2,30,0,1346,0.829,1.304,N/A
OAS1_0045_MR1,M,R,29,,,,,1590,0.829,1.104,N/A
OAS1_0046_MR1,M,R,64,2,,22,0.5,1351,0.787,1.299,N/A
OAS1_0047_MR1,F,R,57,,,,,1408,0.784,1.247,N/A
OAS1_0049_MR1,F,R,20,,,,,1329,0.887,1.321,N/A
OAS1_0050_MR1,F,R,48,,,,,1358,0.841,1.293,N/A
OAS1_0051_MR1,F,R,24,,,,,1567,0.835,1.12,N/A
OAS1_0052_MR1,F,R,78,1,5,23,1,1462,0.697,1.2,N/A
OAS1_0053_MR1,F,R,83,1,4,21,1,1384,0.699,1.268,N/A
OAS1_0054_MR1,F,R,21,,,,,1567,0.848,1.12,N/A
OAS1_0055_MR1,F,R,20,,,,,1432,0.831,1.226,N/A
OAS1_0056_MR1,F,R,72,3,3,15,1,1324,0.668,1.325,N/A
OAS1_0057_MR1,F,R,21,,,,,1333,0.862,1.317,N/A
OAS1_0058_MR1,F,R,46,5,1,30,0,1585,0.817,1.107,N/A
OAS1_0059_MR1,F,R,20,,,,,1396,0.827,1.257,N/A
OAS1_0060_MR1,M,R,79,4,,29,0.5,1564,0.734,1.122,N/A
OAS1_0061_MR1,F,R,20,,,,,1749,0.84,1.441,N/A
OAS1_0062_MR1,F,R,73,3,2,30,0,1456,0.754,1.205,N/A
OAS1_0063_MR1,M,R,48,,,,,1675,0.818,1.048,N/A
OAS1_0064_MR1,F,R,77,1,4,29,0,1583,0.767,1.108,N/A
OAS1_0065_MR1,M,R,90,2,3,25,0,1301,0.645,1.349,N/A
OAS1_0066_MR1,F,R,66,1,4,28,0.5,1309,0.765,1.341,N/A
OAS1_0067_MR1,F,R,71,4,1,27,1,1549,0.73,1.133,N/A
OAS1_0068_MR1,F,R,67,3,4,30,0,1508,0.805,1.164,N/A
OAS1_0069_MR1,M,R,33,4,1,30,0,1709,0.784,1.027,N/A
OAS1_0070_MR1,F,R,63,3,2,30,0,1327,0.801,1.323,N/A
OAS1_0071_MR1,F,R,49,5,1,30,0,1459,0.808,1.203,N/A
OAS1_0072_MR1,F,R,60,5,1,30,0,1402,0.823,1.252,N/A
OAS1_0073_MR1,F,R,69,2,4,21,1,1495,0.655,1.174,N/A
OAS1_0074_MR1,M,R,43,4,,30,0,1547,0.847,1.134,N/A
OAS1_0075_MR1,F,R,83,3,2,30,0,1335,0.72,1.314,N/A
OAS1_0076_MR1,F,R,18,,,,,1501,0.839,1.169,N/A
OAS1_0077_MR1,F,R,20,,,,,1537,0.852,1.142,N/A
OAS1_0078_MR1,F,R,64,3,2,30,0,1395,0.809,1.258,N/A
OAS1_0079_MR1,F,R,25,,,,,1522,0.826,1.153,N/A
OAS1_0080_MR1,F,R,25,,,,,1628,0.857,1.078,N/A
OAS1_0081_MR1,F,R,18,,,,,1309,0.857,1.341,N/A
OAS1_0082_MR1,F,R,75,2,3,28,0.5,1407,0.776,1.247,N/A
OAS1_0083_MR1,F,R,90,5,3,27,0,1200,0.727,1.462,N/A
OAS1_0084_MR1,F,R,81,2,,27,0.5,1453,0.727,1.208,N/A
OAS1_0085_MR1,F,R,70,2,3,29,0,1283,0.791,1.368,N/A
OAS1_0086_MR1,F,R,47,4,1,30,0,1311,0.835,1.339,N/A
OAS1_0087_MR1,F,R,21,,,,,1507,0.845,1.165,N/A
OAS1_0088_MR1,F,R,40,,,,,1557,0.865,1.127,N/A
OAS1_0090_MR1,M,R,20,,,,,1728,0.862,1.016,N/A
OAS1_0091_MR1,F,R,18,,,,,1701,0.834,1.032,N/A
OAS1_0092_MR1,M,R,22,,,,,1442,0.834,1.217,N/A
OAS1_0094_MR1,F,R,66,2,3,30,0.5,1447,0.772,1.213,N/A
OAS1_0095_MR1,M,R,28,,,,,1578,0.856,1.112,N/A
OAS1_0096_MR1,F,R,47,5,2,29,0,1357,0.809,1.294,N/A
OAS1_0097_MR1,M,R,23,,,,,1568,0.816,1.119,N/A
OAS1_0098_MR1,F,R,67,2,,18,0.5,1653,0.693,1.062,N/A
OAS1_0099_MR1,F,R,19,,,,,1484,0.878,1.183,N/A
OAS1_0101_MR1,M,R,29,,,,,1486,0.84,1.181,N/A
OAS1_0102_MR1,M,R,18,,,,,1542,0.85,1.138,N/A
OAS1_0103_MR1,F,R,19,,,,,1499,0.85,1.17,N/A
OAS1_0104_MR1,F,R,24,,,,,1447,0.841,1.213,N/A
OAS1_0105_MR1,M,R,20,,,,,1512,0.839,1.161,N/A
OAS1_0106_MR1,F,R,81,2,4,30,0,1230,0.717,1.427,N/A
OAS1_0107_MR1,M,R,20,,,,,1733,0.853,1.013,N/A
OAS1_0108_MR1,M,R,25,,,,,1825,0.854,0.962,N/A
OAS1_0109_MR1,F,R,61,4,3,30,0,1313,0.813,1.337,N/A
OAS1_0110_MR1,M,R,84,3,4,28,0,1483,0.697,1.183,N/A
OAS1_0111_MR1,M,R,23,,,,,1711,0.855,1.025,N/A
OAS1_0112_MR1,F,R,69,5,2,29,0,1536,0.733,1.143,N/A
OAS1_0113_MR1,F,R,83,2,2,29,0,1569,0.768,1.118,N/A
OAS1_0114_MR1,M,R,62,2,4,30,0,1378,0.804,1.274,N/A
OAS1_0115_MR1,M,R,72,5,1,26,0.5,1911,0.726,0.919,N/A
OAS1_0116_MR1,F,R,52,5,1,30,0,1373,0.784,1.279,N/A
OAS1_0117_MR1,M,R,25,,,,,1759,0.783,0.998,N/A
OAS1_0119_MR1,M,R,19,,,,,1502,0.838,1.169,N/A
OAS1_0120_MR1,M,R,70,4,4,26,0.5,1796,0.736,0.977,N/A
OAS1_0121_MR1,M,R,26,,,,,1684,0.82,1.042,N/A
OAS1_0122_MR1,F,R,83,5,2,22,1,1377,0.715,1.274,N/A
OAS1_0123_MR1,F,R,83,3,4,24,0.5,1282,0.797,1.369,N/A
OAS1_0124_MR1,M,R,73,2,,23,0.5,1661,0.709,1.056,N/A
OAS1_0125_MR1,F,R,22,,,,,1537,0.832,1.142,N/A
OAS1_0126_MR1,M,R,21,,,,,1582,0.885,1.11,N/A
OAS1_0127_MR1,M,R,30,,,,,1538,0.862,1.141,N/A
OAS1_0129_MR1,M,R,18,,,,,1514,0.846,1.159,N/A
OAS1_0130_MR1,M,R,68,3,3,26,0,1444,0.789,1.216,N/A
OAS1_0131_MR1,M,R,24,,,,,1637,0.824,1.072,N/A
OAS1_0132_MR1,M,R,22,,,,,1596,0.85,1.099,N/A
OAS1_0133_MR1,F,R,65,5,2,30,0,1277,0.814,1.374,N/A
OAS1_0134_MR1,M,R,80,2,4,20,1,1494,0.665,1.175,N/A
OAS1_0135_MR1,M,R,64,2,4,29,0,1561,0.801,1.124,N/A
OAS1_0136_MR1,F,R,24,,,,,1178,0.873,1.489,N/A
OAS1_0137_MR1,F,R,87,2,3,22,1,1499,0.672,1.171,N/A
OAS1_0138_MR1,M,R,80,2,4,28,0,1689,0.706,1.039,N/A
OAS1_0139_MR1,F,R,72,3,3,28,0,1512,0.779,1.161,N/A
OAS1_0140_MR1,F,R,23,,,,,1375,0.872,1.277,N/A
OAS1_0141_MR1,M,R,24,,,,,1523,0.846,1.152,N/A
OAS1_0142_MR1,M,R,70,4,1,27,0.5,1581,0.695,1.11,N/A
OAS1_0143_MR1,M,R,66,2,4,30,0.5,1446,0.784,1.214,N/A
OAS1_0144_MR1,M,R,22,,,,,1799,0.865,0.975,N/A
OAS1_0145_MR1,M,R,34,,,,,1653,0.831,1.062,N/A
OAS1_0146_MR1,F,R,82,5,1,28,0,1513,0.742,1.16,N/A
OAS1_0147_MR1,F,R,25,,,,,1663,0.845,1.055,N/A
OAS1_0148_MR1,M,R,23,,,,,1497,0.811,1.172,N/A
OAS1_0150_MR1,F,R,20,,,,,1510,0.875,1.162,N/A
OAS1_0151_MR1,F,R,25,,,,,1439,0.856,1.22,N/A
OAS1_0152_MR1,F,R,23,,,,,1471,0.83,1.193,N/A
OAS1_0153_MR1,M,R,23,,,,,1662,0.85,1.056,N/A
OAS1_0155_MR1,M,R,71,4,,28,0.5,1359,0.753,1.291,N/A
OAS1_0156_MR1,F,R,20,,,,,1591,0.834,1.103,N/A
OAS1_0157_MR1,F,R,86,4,3,30,0,1293,0.756,1.357,N/A
OAS1_0158_MR1,M,R,81,5,1,26,0.5,1556,0.689,1.128,N/A
OAS1_0159_MR1,F,R,40,,,,,1437,0.821,1.221,N/A
OAS1_0160_MR1,M,R,57,,,,,1745,0.813,1.006,N/A
OAS1_0161_MR1,F,R,84,2,2,27,0.5,1390,0.727,1.263,N/A
OAS1_0162_MR1,F,R,20,,,,,1219,0.872,1.44,N/A
OAS1_0163_MR1,F,R,18,,,,,1633,0.859,1.075,N/A
OAS1_0164_MR1,F,R,81,2,3,28,0.5,1495,0.687,1.174,N/A
OAS1_0165_MR1,F,R,74,2,3,29,0,1395,0.787,1.258,N/A
OAS1_0166_MR1,F,R,80,2,,27,0.5,1475,0.771,1.19,N/A
OAS1_0167_MR1,F,R,41,,,,,1361,0.849,1.289,N/A
OAS1_0168_MR1,F,R,50,,,,,1411,0.846,1.244,N/A
OAS1_0169_MR1,F,R,88,2,3,30,0,1445,0.718,1.215,N/A
OAS1_0170_MR1,M,R,71,2,4,29,0,1455,0.725,1.206,N/A
OAS1_0173_MR1,M,R,35,,,,,1475,0.829,1.19,N/A
OAS1_0174_MR1,M,R,23,,,,,1415,0.865,1.241,N/A
OAS1_0176_MR1,F,R,88,3,1,29,0,1398,0.712,1.255,N/A
OAS1_0177_MR1,F,R,54,4,1,30,0,1494,0.838,1.174,N/A
OAS1_0178_MR1,F,R,44,,,,,1272,0.853,1.38,N/A
OAS1_0179_MR1,F,R,87,2,4,21,0.5,1250,0.653,1.405,N/A
OAS1_0180_MR1,F,R,80,4,2,30,0,1496,0.745,1.173,N/A
OAS1_0181_MR1,F,R,49,4,2,30,0,1316,0.82,1.334,N/A
OAS1_0182_MR1,M,R,48,,,,,1561,0.816,1.124,N/A
OAS1_0183_MR1,M,R,44,,,,,1908,0.816,0.92,N/A
OAS1_0184_MR1,F,R,65,2,,16,1,1521,0.669,1.154,N/A
OAS1_0185_MR1,F,R,78,2,4,17,1,1314,0.739,1.336,N/A
OAS1_0186_MR1,M,R,84,5,1,29,0,1707,0.731,1.028,N/A
OAS1_0188_MR1,M,R,48,4,2,30,0,1464,0.79,1.199,N/A
OAS1_0189_MR1,M,R,22,,,,,1628,0.853,1.078,N/A
OAS1_0190_MR1,M,R,43,,,,,1561,0.813,1.124,N/A
OAS1_0191_MR1,F,R,21,,,,,1421,0.835,1.235,N/A
OAS1_0192_MR1,F,R,31,,,,,1294,0.839,1.357,N/A
OAS1_0193_MR1,F,R,23,,,,,1546,0.831,1.135,N/A
OAS1_0195_MR1,F,R,76,4,1,28,0,1346,0.766,1.304,N/A
OAS1_0197_MR1,F,R,89,3,3,29,0,1154,0.747,1.521,N/A
OAS1_0198_MR1,F,R,21,,,,,1332,0.852,1.317,N/A
OAS1_0199_MR1,M,R,69,5,1,30,0,1601,0.784,1.096,N/A
OAS1_0200_MR1,F,R,60,2,4,30,0,1366,0.807,1.285,N/A
OAS1_0201_MR1,F,R,85,4,1,26,0,1460,0.754,1.202,N/A
OAS1_0202_MR1,F,R,23,,,,,1574,0.865,1.115,N/A
OAS1_0203_MR1,F,R,71,2,3,30,0,1360,0.779,1.291,N/A
OAS1_0204_MR1,M,R,48,4,1,29,0,1430,0.797,1.227,N/A
OAS1_0205_MR1,M,R,75,4,1,30,0.5,1891,0.716,0.928,N/A
OAS1_0206_MR1,F,R,78,5,1,30,0,1243,0.747,1.412,N/A
OAS1_0207_MR1,M,R,51,5,2,29,0,1714,0.819,1.024,N/A
OAS1_0208_MR1,F,R,55,5,1,29,0,1368,0.823,1.283,N/A
OAS1_0209_MR1,F,R,22,,,,,1328,0.842,1.321,N/A
OAS1_0210_MR1,F,R,73,4,1,28,0.5,1676,0.722,1.047,N/A
OAS1_0211_MR1,M,R,20,,,,,1657,0.849,1.059,N/A
OAS1_0212_MR1,F,R,74,3,,28,0,1614,0.697,1.087,N/A
OAS1_0213_MR1,F,R,48,,,,,1332,0.801,1.318,N/A
OAS1_0214_MR1,M,R,18,,,,,1854,0.87,0.947,N/A
OAS1_0216_MR1,F,R,71,4,3,30,0,1503,0.792,1.168,N/A
OAS1_0217_MR1,F,R,78,4,3,27,0.5,1393,0.692,1.26,N/A
OAS1_0218_MR1,F,R,26,,,,,1291,0.843,1.36,N/A
OAS1_0220_MR1,F,R,75,5,1,30,0,1317,0.742,1.332,N/A
OAS1_0221_MR1,F,R,94,5,1,29,0,1474,0.696,1.19,N/A
OAS1_0222_MR1,F,R,49,,,,,1164,0.805,1.508,N/A
OAS1_0223_MR1,M,R,84,2,,20,1,1641,0.703,1.07,N/A
OAS1_0224_MR1,F,R,22,,,,,1378,0.852,1.274,N/A
OAS1_0226_MR1,M,R,90,1,4,23,0.5,1668,0.644,1.052,N/A
OAS1_0227_MR1,F,R,26,,,,,1288,0.777,1.362,N/A
OAS1_0228_MR1,F,R,81,3,2,28,0,1486,0.759,1.181,N/A
OAS1_0229_MR1,F,R,55,3,3,30,0,1327,0.832,1.323,N/A
OAS1_0230_MR1,F,R,19,,,,,1584,0.846,1.108,N/A
OAS1_0231_MR1,F,R,20,,,,,1429,0.852,1.228,N/A
OAS1_0232_MR1,M,R,22,,,,,1582,0.857,1.11,N/A
OAS1_0233_MR1,F,R,77,1,4,20,0.5,1376,0.701,1.275,N/A
OAS1_0234_MR1,M,R,75,5,2,29,0,1534,0.771,1.144,N/A
OAS1_0235_MR1,M,R,37,,,,,1407,0.842,1.247,N/A
OAS1_0236_MR1,F,R,20,,,,,1218,0.876,1.441,N/A
OAS1_0237_MR1,F,R,72,2,2,27,0,1322,0.764,1.328,N/A
OAS1_0238_MR1,F,R,77,2,3,28,0.5,1484,0.786,1.182,N/A
OAS1_0239_MR1,F,R,29,,,,,1439,0.823,1.22,N/A
OAS1_0240_MR1,F,R,74,2,,26,0.5,1171,0.736,1.499,N/A
OAS1_0241_MR1,F,R,74,5,2,30,0,1400,0.754,1.254,N/A
OAS1_0243_MR1,M,R,64,5,2,22,0.5,1547,0.742,1.134,N/A
OAS1_0244_MR1,F,R,80,4,2,29,0,1341,0.737,1.309,N/A
OAS1_0246_MR1,F,R,22,,,,,1522,0.841,1.153,N/A
OAS1_0247_MR1,M,R,90,2,3,21,0.5,1307,0.689,1.342,N/A
OAS1_0249_MR1,F,R,28,,,,,1217,0.871,1.443,N/A
OAS1_0250_MR1,M,R,21,,,,,1500,0.837,1.17,N/A
OAS1_0253_MR1,F,R,20,,,,,1751,0.852,1.002,N/A
OAS1_0254_MR1,F,R,85,5,1,29,0,1264,0.705,1.388,N/A
OAS1_0255_MR1,F,R,71,5,1,30,0,1426,0.737,1.231,N/A
OAS1_0256_MR1,M,R,70,5,1,30,0,1660,0.739,1.057,N/A
OAS1_0258_MR1,F,R,21,,,,,1516,0.87,1.158,N/A
OAS1_0259_MR1,F,R,78,3,2,29,0,1334,0.773,1.316,N/A
OAS1_0260_MR1,M,R,87,2,4,30,0,1762,0.719,0.996,N/A
OAS1_0261_MR1,M,R,28,,,,,1417,0.845,1.238,N/A
OAS1_0262_MR1,M,R,46,2,3,30,0,1604,0.784,1.094,N/A
OAS1_0263_MR1,M,R,79,4,1,30,0.5,1722,0.709,1.019,N/A
OAS1_0264_MR1,M,R,24,,,,,1591,0.849,1.103,N/A
OAS1_0265_MR1,F,R,54,,,,,1410,0.813,1.245,N/A
OAS1_0266_MR1,M,R,51,5,1,30,0,1793,0.834,0.979,N/A
OAS1_0267_MR1,M,R,80,5,2,28,0.5,1506,0.679,1.166,N/A
OAS1_0268_MR1,M,R,78,2,3,23,1,1491,0.715,1.177,N/A
OAS1_0269_MR1,F,R,72,1,4,21,1,1489,0.683,1.179,N/A
OAS1_0270_MR1,F,R,93,3,2,30,0,1272,0.703,1.38,N/A
OAS1_0271_MR1,F,R,89,2,4,27,0,1329,0.74,1.32,N/A
OAS1_0272_MR1,F,R,75,3,2,26,0.5,1355,0.745,1.296,N/A
OAS1_0273_MR1,F,R,89,1,4,18,0.5,1480,0.676,1.186,N/A
OAS1_0274_MR1,F,R,58,3,3,30,0,1373,0.815,1.278,N/A
OAS1_0275_MR1,M,R,50,,,,,1635,0.802,1.073,N/A
OAS1_0277_MR1,M,R,22,,,,,1913,0.841,0.917,N/A
OAS1_0278_MR1,F,R,96,5,1,26,1,1465,0.684,1.198,N/A
OAS1_0279_MR1,F,R,73,1,4,30,0,1475,0.721,1.19,N/A
OAS1_0280_MR1,F,R,78,5,1,30,0,1440,0.67,1.219,N/A
OAS1_0281_MR1,M,R,28,,,,,1538,0.835,1.141,N/A
OAS1_0282_MR1,F,R,45,,,,,1478,0.819,1.188,N/A
OAS1_0283_MR1,F,R,18,,,,,1578,0.836,1.112,N/A
OAS1_0284_MR1,F,R,91,5,2,30,0,1714,0.746,1.024,N/A
OAS1_0285_MR1,M,R,20,,,,,1470,0.843,1.194,N/A
OAS1_0286_MR1,F,R,83,3,2,20,0.5,1476,0.751,1.189,N/A
OAS1_0287_MR1,F,R,78,3,3,21,0.5,1194,0.694,1.47,N/A
OAS1_0288_MR1,M,R,71,2,4,20,0.5,1461,0.727,1.202,N/A
OAS1_0289_MR1,F,R,59,3,2,28,0,1334,0.767,1.316,N/A
OAS1_0290_MR1,M,R,83,3,2,26,0.5,1992,0.706,0.881,N/A
OAS1_0291_MR1,F,R,73,2,2,19,1,1274,0.745,1.377,N/A
OAS1_0292_MR1,F,R,64,4,2,30,0,1415,0.766,1.24,N/A
OAS1_0293_MR1,F,R,69,1,2,26,0,1384,0.783,1.268,N/A
OAS1_0294_MR1,F,R,20,,,,,1439,0.841,1.22,N/A
OAS1_0295_MR1,F,R,20,,,,,1412,0.803,1.243,N/A
OAS1_0296_MR1,F,R,28,,,,,1428,0.869,1.229,N/A
OAS1_0298_MR1,F,R,72,4,3,24,0.5,1354,0.738,1.296,N/A
OAS1_0299_MR1,F,R,90,2,3,29,0,1475,0.671,1.19,N/A
OAS1_0300_MR1,M,R,68,3,2,30,0.5,1556,0.723,1.128,N/A
OAS1_0301_MR1,F,R,90,3,2,28,0,1495,0.761,1.174,N/A
OAS1_0302_MR1,M,R,22,,,,,1570,0.831,1.118,N/A
OAS1_0303_MR1,F,R,67,2,4,30,0,1221,0.831,1.438,N/A
OAS1_0304_MR1,M,R,84,3,3,29,0.5,1497,0.693,1.172,N/A
OAS1_0305_MR1,M,R,48,,,,,1454,0.85,1.207,N/A
OAS1_0307_MR1,M,R,67,4,2,23,0.5,1399,0.735,1.255,N/A
OAS1_0308_MR1,F,R,78,3,3,15,2,1401,0.703,1.253,N/A
OAS1_0309_MR1,F,R,54,2,2,30,0,1441,0.786,1.218,N/A
OAS1_0310_MR1,F,R,20,,,,,1388,0.863,1.265,N/A
OAS1_0311_MR1,F,R,22,,,,,1366,0.83,1.285,N/A
OAS1_0312_MR1,F,R,73,3,,26,0.5,1311,0.756,1.339,N/A
OAS1_0313_MR1,F,R,20,,,,,1516,0.838,1.158,N/A
OAS1_0314_MR1,M,R,27,,,,,1720,0.84,1.02,N/A
OAS1_0315_MR1,M,R,77,5,1,25,0.5,1604,0.773,1.094,N/A
OAS1_0316_MR1,F,R,72,4,2,22,1,1493,0.69,1.176,N/A
OAS1_0317_MR1,M,R,86,4,1,26,0,1501,0.702,1.169,N/A
OAS1_0318_MR1,M,R,33,,,,,1634,0.836,1.074,N/A
OAS1_0319_MR1,M,R,31,,,,,1527,0.821,1.149,N/A
OAS1_0321_MR1,M,R,19,,,,,1478,0.843,1.187,N/A
OAS1_0322_MR1,F,R,65,3,4,29,0,1335,0.776,1.315,N/A
OAS1_0323_MR1,F,R,50,5,1,30,0,1370,0.826,1.281,N/A
OAS1_0325_MR1,F,R,27,,,,,1422,0.869,1.234,N/A
OAS1_0326_MR1,F,R,73,3,4,29,0,1272,0.7,1.38,N/A
OAS1_0327_MR1,M,R,50,,,,,1740,0.794,1.008,N/A
OAS1_0328_MR1,M,R,19,,,,,1453,0.878,1.208,N/A
OAS1_0329_MR1,F,R,80,2,3,29,0.5,1209,0.76,1.451,N/A
OAS1_0330_MR1,F,R,80,1,5,27,0,1381,0.752,1.27,N/A
OAS1_0331_MR1,F,R,54,,,,,1467,0.821,1.196,N/A
OAS1_0332_MR1,M,R,72,1,3,29,0,1734,0.762,1.012,N/A
OAS1_0333_MR1,M,R,26,,,,,1607,0.85,1.092,N/A
OAS1_0335_MR1,F,R,80,1,4,27,0.5,1654,0.678,1.061,N/A
OAS1_0336_MR1,F,R,41,,,,,1528,0.852,1.149,N/A
OAS1_0337_MR1,M,R,81,1,4,28,0,1750,0.676,1.003,N/A
OAS1_0338_MR1,M,R,77,4,1,29,0,1818,0.736,0.965,N/A
OAS1_0339_MR1,F,R,79,2,,24,0.5,1211,0.694,1.449,N/A
OAS1_0340_MR1,M,R,19,,,,,1650,0.853,1.063,N/A
OAS1_0341_MR1,F,R,71,2,4,30,0,1479,0.772,1.187,N/A
OAS1_0342_MR1,F,R,88,2,3,28,0,1370,0.765,1.281,N/A
OAS1_0343_MR1,M,R,68,3,3,30,0,1441,0.811,1.217,N/A
OAS1_0344_MR1,M,R,20,,,,,1510,0.851,1.163,N/A
OAS1_0345_MR1,F,R,54,4,2,30,0,1389,0.831,1.264,N/A
OAS1_0346_MR1,M,R,23,,,,,1485,0.843,1.181,N/A
OAS1_0348_MR1,F,R,22,,,,,1473,0.841,1.191,N/A
OAS1_0349_MR1,F,R,43,,,,,1227,0.858,1.43,N/A
OAS1_0350_MR1,M,R,21,,,,,1577,0.869,1.113,N/A
OAS1_0351_MR1,M,R,86,1,4,15,2,1512,0.665,1.161,N/A
OAS1_0352_MR1,F,R,81,5,2,26,0.5,1174,0.743,1.495,N/A
OAS1_0353_MR1,M,R,22,,,,,1680,0.8,1.044,N/A
OAS1_0354_MR1,M,R,74,1,3,26,0,1367,0.776,1.284,N/A
OAS1_0355_MR1,F,R,73,4,2,29,0,1123,0.79,1.563,N/A
OAS1_0356_MR1,F,R,68,3,2,30,0,1506,0.74,1.165,N/A
OAS1_0357_MR1,F,R,55,4,3,30,0,1450,0.82,1.21,N/A
OAS1_0358_MR1,M,R,65,3,3,29,0,1362,0.839,1.289,N/A
OAS1_0359_MR1,M,R,21,,,,,1714,0.864,1.024,N/A
OAS1_0361_MR1,M,R,20,,,,,1485,0.842,1.182,N/A
OAS1_0362_MR1,F,R,63,3,,14,0.5,1439,0.716,1.219,N/A
OAS1_0363_MR1,M,R,87,4,2,30,0,1398,0.702,1.255,N/A
OAS1_0365_MR1,M,R,74,5,2,30,0,1806,0.754,0.972,N/A
OAS1_0366_MR1,F,R,45,5,2,29,0,1549,0.813,1.133,N/A
OAS1_0367_MR1,F,R,46,2,2,28,0,1161,0.841,1.511,N/A
OAS1_0368_MR1,M,R,22,,,,,1572,0.856,1.116,N/A
OAS1_0369_MR1,F,R,73,4,1,28,0,1295,0.772,1.356,N/A
OAS1_0370_MR1,M,R,23,,,,,1734,0.847,1.012,N/A
OAS1_0371_MR1,F,R,70,3,4,30,0,1361,0.783,1.29,N/A
OAS1_0372_MR1,M,R,59,3,2,29,0,1596,0.817,1.1,N/A
OAS1_0373_MR1,F,R,80,3,2,20,1,1732,0.692,1.013,N/A
OAS1_0374_MR1,F,R,73,3,3,29,0.5,1238,0.76,1.418,N/A
OAS1_0375_MR1,M,R,46,,,,,1617,0.775,1.086,N/A
OAS1_0376_MR1,M,R,31,,,,,1579,0.817,1.111,N/A
OAS1_0377_MR1,M,R,25,,,,,1567,0.831,1.12,N/A
OAS1_0378_MR1,F,R,58,2,2,30,0,1418,0.821,1.238,N/A
OAS1_0379_MR1,F,R,20,,,,,1255,0.866,1.398,N/A
OAS1_0380_MR1,F,R,83,1,5,18,0.5,1313,0.705,1.337,N/A
OAS1_0381_MR1,M,R,59,4,2,29,0,1795,0.809,0.978,N/A
OAS1_0382_MR1,F,R,67,4,,15,1,1288,0.763,1.362,N/A
OAS1_0383_MR1,M,R,58,,,,,1590,0.746,1.104,N/A
OAS1_0384_MR1,F,R,38,,,,,1562,0.844,1.123,N/A
OAS1_0385_MR1,M,R,22,,,,,1643,0.841,1.068,N/A
OAS1_0386_MR1,F,R,26,,,,,1490,0.838,1.178,N/A
OAS1_0387_MR1,F,R,26,,,,,1149,0.851,1.527,N/A
OAS1_0388_MR1,F,R,77,2,4,22,1,1350,0.736,1.3,N/A
OAS1_0389_MR1,M,R,55,,,,,1678,0.782,1.046,N/A
OAS1_0390_MR1,M,R,69,2,2,24,0.5,1480,0.794,1.186,N/A
OAS1_0392_MR1,F,R,24,,,,,1441,0.848,1.218,N/A
OAS1_0394_MR1,F,R,22,,,,,1343,0.847,1.307,N/A
OAS1_0395_MR1,F,R,26,,,,,1295,0.834,1.356,N/A
OAS1_0396_MR1,M,R,25,,,,,1674,0.832,1.048,N/A
OAS1_0397_MR1,F,R,20,,,,,1265,0.846,1.387,N/A
OAS1_0398_MR1,M,R,71,5,1,30,0,1769,0.716,0.992,N/A
OAS1_0399_MR1,M,R,78,2,,29,1,1569,0.706,1.119,N/A
OAS1_0400_MR1,F,R,92,5,1,25,0.5,1774,0.644,0.989,N/A
OAS1_0401_MR1,F,R,54,4,3,29,0,1287,0.827,1.364,N/A
OAS1_0402_MR1,F,R,76,3,2,30,0.5,1350,0.763,1.3,N/A
OAS1_0403_MR1,M,R,19,,,,,1592,0.833,1.102,N/A
OAS1_0404_MR1,F,R,73,2,2,29,0,1465,0.776,1.198,N/A
OAS1_0405_MR1,M,R,77,5,1,23,1,1713,0.761,1.024,N/A
OAS1_0406_MR1,F,R,25,,,,,1346,0.855,1.303,N/A
OAS1_0407_MR1,F,R,55,,,,,1434,0.807,1.224,N/A
OAS1_0408_MR1,F,R,22,,,,,1518,0.861,1.156,N/A
OAS1_0409_MR1,M,R,34,,,,,1569,0.798,1.118,N/A
OAS1_0410_MR1,F,R,23,,,,,1507,0.87,1.165,N/A
OAS1_0411_MR1,F,R,71,5,1,29,0.5,1346,0.742,1.304,N/A
OAS1_0413_MR1,F,R,25,,,,,1447,0.866,1.213,N/A
OAS1_0415_MR1,F,R,21,,,,,1542,0.859,1.138,N/A
OAS1_0416_MR1,F,R,23,,,,,1567,0.852,1.12,N/A
OAS1_0417_MR1,F,R,30,,,,,1551,0.855,1.132,N/A
OAS1_0418_MR1,M,R,74,5,2,28,0.5,1659,0.747,1.058,N/A
OAS1_0419_MR1,F,R,21,,,,,1473,0.862,1.191,N/A
OAS1_0420_MR1,F,R,22,,,,,1732,0.848,1.013,N/A
OAS1_0421_MR1,F,R,22,,,,,1655,0.847,1.061,N/A
OAS1_0422_MR1,F,R,69,4,3,29,0,1380,0.809,1.272,N/A
OAS1_0423_MR1,M,R,75,2,4,28,0,1511,0.749,1.162,N/A
OAS1_0424_MR1,M,R,75,4,1,20,1,1613,0.715,1.088,N/A
OAS1_0425_MR1,F,R,78,1,4,23,1,1461,0.715,1.201,N/A
OAS1_0426_MR1,F,R,82,5,2,29,0,1316,0.791,1.334,N/A
OAS1_0428_MR1,F,R,84,4,3,28,0,1500,0.751,1.17,N/A
OAS1_0429_MR1,F,R,45,,,,,1385,0.808,1.267,N/A
OAS1_0430_MR1,M,R,71,4,1,17,1,1562,0.687,1.123,N/A
OAS1_0431_MR1,F,R,22,,,,,1405,0.822,1.249,N/A
OAS1_0432_MR1,F,R,72,2,4,26,0.5,1453,0.773,1.208,N/A
OAS1_0433_MR1,M,R,58,4,1,27,0,1606,0.779,1.093,N/A
OAS1_0434_MR1,F,R,50,,,,,1385,0.819,1.267,N/A
OAS1_0435_MR1,M,R,23,,,,,1766,0.82,0.994,N/A
OAS1_0437_MR1,F,R,22,,,,,1444,0.853,1.216,N/A
OAS1_0438_MR1,F,R,66,5,2,29,0,1191,0.787,1.474,N/A
OAS1_0439_MR1,M,R,21,,,,,1438,0.844,1.221,N/A
OAS1_0440_MR1,M,R,86,1,4,27,0.5,1320,0.723,1.329,N/A
OAS1_0441_MR1,M,R,81,5,1,29,0.5,1647,0.721,1.066,N/A
OAS1_0442_MR1,F,R,23,,,,,1431,0.847,1.227,N/A
OAS1_0443_MR1,F,R,52,3,3,30,0,1431,0.814,1.226,N/A
OAS1_0444_MR1,F,R,30,,,,,1250,0.86,1.404,N/A
OAS1_0445_MR1,F,R,90,1,2,29,0,1362,0.673,1.289,N/A
OAS1_0446_MR1,F,R,80,2,4,30,0,1390,0.748,1.263,N/A
OAS1_0447_MR1,F,R,92,4,1,24,0.5,1388,0.739,1.264,N/A
OAS1_0448_MR1,F,R,22,,,,,1524,0.858,1.152,N/A
OAS1_0449_MR1,F,R,71,3,4,29,0,1264,0.818,1.388,N/A
OAS1_0450_MR1,M,R,19,,,,,1478,0.88,1.188,N/A
OAS1_0451_MR1,M,R,73,5,3,27,0.5,1687,0.728,1.04,N/A
OAS1_0452_MR1,M,R,75,1,4,22,1,1656,0.762,1.06,N/A
OAS1_0453_MR1,F,R,70,1,4,29,0.5,1295,0.748,1.355,N/A
OAS1_0454_MR1,F,R,73,3,2,23,0.5,1536,0.73,1.142,N/A
OAS1_0455_MR1,F,R,61,2,4,28,0,1354,0.825,1.297,N/A
OAS1_0456_MR1,M,R,61,5,2,30,0,1637,0.78,1.072,N/A
OAS1_0457_MR1,F,R,62,3,3,26,0,1372,0.766,1.279,N/A
OAS1_0061_MR2,F,R,20,,,,,1757,0.845,0.999,1
OAS1_0080_MR2,F,R,25,,,,,1605,0.841,1.093,20
OAS1_0092_MR2,M,R,22,,,,,1457,0.835,1.205,5
OAS1_0101_MR2,M,R,29,,,,,1501,0.835,1.169,64
OAS1_0111_MR2,M,R,23,,,,,1714,0.861,1.024,2
OAS1_0117_MR2,M,R,25,,,,,1753,0.782,1.001,5
OAS1_0145_MR2,M,R,34,,,,,1654,0.832,1.061,10
OAS1_0150_MR2,F,R,20,,,,,1506,0.876,1.165,1
OAS1_0156_MR2,F,R,20,,,,,1577,0.832,1.113,12
OAS1_0191_MR2,F,R,21,,,,,1416,0.837,1.239,28
OAS1_0202_MR2,F,R,23,,,,,1548,0.861,1.134,21
OAS1_0230_MR2,F,R,19,,,,,1577,0.849,1.113,24
OAS1_0236_MR2,F,R,20,,,,,1222,0.872,1.436,3
OAS1_0239_MR2,F,R,29,,,,,1438,0.822,1.221,40
OAS1_0249_MR2,F,R,28,,,,,1215,0.865,1.444,3
OAS1_0285_MR2,M,R,20,,,,,1469,0.847,1.195,2
OAS1_0353_MR2,M,R,22,,,,,1684,0.79,1.042,40
OAS1_0368_MR2,M,R,22,,,,,1580,0.856,1.111,89
OAS1_0379_MR2,F,R,20,,,,,1262,0.861,1.39,2
OAS1_0395_MR2,F,R,26,,,,,1283,0.834,1.368,39
